Garuda

CryptoNote currencies announcements and official reviews

Re: Garuda

Postby *tech_star* » Thu Jun 25, 2015 1:35 pm

Never seen such a things in any of the CryptoNote based coins before. Give me a link to your github repo, please!
*tech_star*
 
Posts: 35
Joined: Fri Mar 28, 2014 9:51 am

Re: Garuda

Postby Werner_Albert » Thu Jun 25, 2015 1:51 pm

pakpahan,
Please try to reproduce the same thing in CryptoNoteCoin. If you will succeed, please, describe the actions you do before it appears. If not, compare the code of your coin and the code of CryptoNoteCoin. It will help you to find the problem.
Werner_Albert
 
Posts: 56
Joined: Wed Mar 26, 2014 3:23 pm

Re: Garuda

Postby pakpahan » Sat Jul 04, 2015 11:28 am

yes werner , i always have trouble to compile with cryptonote core , end up with this :

[ 56%] Building CXX object src/CMakeFiles/wallet.dir/wallet/WalletTransactionSender.cpp.o
[ 57%] Building CXX object src/CMakeFiles/wallet.dir/wallet/WalletErrors.cpp.o
[ 58%] Building CXX object src/CMakeFiles/wallet.dir/wallet/Wallet.cpp.o
/home/malioboro/garuda/src/wallet/Wallet.cpp:30:6: error: ‘void {anonymous}::throwIfKeysMissmatch(const crypto::secret_key&, const crypto::public_key&)’ defined but not used [-Werror=unused-function]
void throwIfKeysMissmatch(const crypto::secret_key& sec, const crypto::public_key& expected_pub) {
^
cc1plus: all warnings being treated as errors
src/CMakeFiles/wallet.dir/build.make:307: recipe for target 'src/CMakeFiles/wallet.dir/wallet/Wallet.cpp.o' failed
make[3]: *** [src/CMakeFiles/wallet.dir/wallet/Wallet.cpp.o] Error 1
make[3]: Leaving directory '/home/malioboro/garuda/build/debug'
CMakeFiles/Makefile2:770: recipe for target 'src/CMakeFiles/wallet.dir/all' failed
make[2]: *** [src/CMakeFiles/wallet.dir/all] Error 2
make[2]: Leaving directory '/home/malioboro/garuda/build/debug'
Makefile:126: recipe for target 'all' failed
make[1]: *** [all] Error 2
make[1]: Leaving directory '/home/malioboro/garuda/build/debug'
Makefile:8: recipe for target 'build-debug' failed
make: *** [build-debug] Error 2

please tell me what i missed

regards
pakpahan
 
Posts: 12
Joined: Thu Jan 01, 2015 9:21 pm

Re: Garuda

Postby Catherine_Erwin » Mon Jul 06, 2015 6:07 pm

What is your os version?
Please, send your git diff to contact@cryptonote.org !
Catherine_Erwin
 
Posts: 102
Joined: Wed Mar 26, 2014 3:28 pm

Re: Garuda

Postby pakpahan » Tue Jul 07, 2015 6:48 pm

sorry for late reply , I'm using ubuntu server 14.1 with dell 4 core and 16 GB Memory to build this, i follow all instrutction on your website and install all dependency's software , but stuck , thats why i ask what did i missed :)
pakpahan
 
Posts: 12
Joined: Thu Jan 01, 2015 9:21 pm

Re: Garuda

Postby *tech_star* » Thu Jul 09, 2015 4:08 pm

pakpahan wrote:sorry for late reply , I'm using ubuntu server 14.1 with dell 4 core and 16 GB Memory to build this, i follow all instrutction on your website and install all dependency's software , but stuck , thats why i ask what did i missed :)


It seems like you use incompatible compiler (lol)
You can edit CMakeList.txt and delete all '-Werror' from the string, which starts with 'set(WARNINGS)'
or
You can delete 'throwIfKeysMissmatch()' from src/wallet/Wallet.cpp
*tech_star*
 
Posts: 35
Joined: Fri Mar 28, 2014 9:51 am

Re: Garuda

Postby pakpahan » Thu Jul 09, 2015 10:03 pm

what do you mean by incompatible compiler ? :D if i edit and delete what you told me to do , is it no impact to the stability program or security or ../?
Thanks
pakpahan
 
Posts: 12
Joined: Thu Jan 01, 2015 9:21 pm

Previous

Return to Announcements

Who is online

Users browsing this forum: No registered users and 1 guest

cron